{"text_format":"1","workbook":"xlsx","n_sheets":11,"sheets":["Assumptions","Base Model","Hedged Model","Scenario","Sensitivity Analysis","Risk Strategy","FX Margins","Gold Future Margins","Monte Carlo Simulation (1000)","Charts from Monte Carlo","Random Data"],"not_rendered":{"charts":21,"images":6,"macros":1,"external_links":2,"defined_names":13,"comments":0,"pivot_tables":0},"unopened":[],"bounds":{"document_bytes":16777216,"sheet_cells":100000,"rows_first":2000,"rows_last":500,"rows_between":2000,"halvings":0,"cell_chars":16384,"cell_head_chars":4096},"cells_cut":0,"cells_raw":0,"read":"whole","date_system":"1900"}

{"sheet":"Assumptions","index":0,"n_rows":62,"n_cols":26,"rows_kept":62,"cut":false,"hidden":false,"merged":[]}
[]
["Gold Dust Expansion: Assumptions"]
[]
[]
[null,"Gold Spot Pricing Assumptions"]
[null,"This section outlines key spot pricing assumptions"]
[]
[]
[null,null,"Case Selected",null,{"$f":"Scenario!$O$12","v":"Base"},null,null,null,null,null,null,2,3,4,1,2,3,4,1,2,3,4]
[null,null,"Price Case",null,null,null,null,null,"17Q3","17Q4","18Q1","18Q2","18Q3","18Q4","19Q1","19Q2","19Q3","19Q4","20Q1","20Q2","20Q3","20Q4","21Q1","21Q2","21Q3","21Q4"]
[null,{"$f":"IF(Scenario!$O$12=$C$11,1,0)","v":1},"Base","USD/Oz","Value Changes of 0%",null,null,null,1350,1350,1350,{"$f":"D18","v":1284.8},{"$f":"E20","v":1290.9000000000001},{"$f":"E23","v":1302.6500000000001},{"$f":"D24","v":1308.5999999999999},{"$f":"E26","v":1314.65},{"$f":"D27","v":1320.9},{"$f":"D28","v":1327.0500000000002},{"$f":"D29","v":1333.2},{"$f":"D30","v":1339.25},{"$f":"D31","v":1345.3},{"$f":"D32","v":1351.4499999999998},{"$f":"D33","v":1357.6},{"$f":"D34","v":1363.65},{"$f":"D35","v":1369.7},{"$f":"D36","v":1376.2}]
[null,{"$f":"IF(Scenario!$O$12=$C$12,1,0)","v":0},"Pessimistic","USD/Oz","Adverse Changes of 20%",null,null,null,{"$f":"I11*0.8","v":1080},{"$f":"J11*0.8","v":1080},{"$f":"K11*0.8","v":1080},{"$f":"L11*0.8","v":1027.8399999999999},{"$f":"M11*0.8","v":1032.72},1042.1200000000001,1046.8799999999999,1051.72,1056.72,1061.6400000000001,1066.5600000000002,1071.4000000000001,1076.24,1081.1599999999999,1086.08,1090.92,1095.76,1100.96]
[null,{"$f":"IF(Scenario!$O$12=$C$13,1,0)","v":0},"Optimistic","USD/Oz","Favourable Changes of 20%",null,null,"Sensitivity",{"$f":"I11*1.2","v":1620},{"$f":"J11*1.2","v":1620},{"$f":"K11*1.2","v":1620},{"$f":"L11*1.2","v":1541.76},{"$f":"M11*1.2","v":1549.0800000000002},1563.18,1570.32,1577.5800000000002,1585.0800000000002,1592.4600000000003,1599.84,1607.1,1614.36,1621.7399999999998,1629.12,1636.38,1643.64,1651.44]
[null,null,"Applied case","USD/Oz",null,null,null,{"$f":"Scenario!E15","v":0},{"$f":"I11*(1+$H$14)","v":1350},{"$f":"J11*(1+$H$14)","v":1350},{"$f":"K11*(1+$H$14)","v":1350},{"$f":"L11*(1+$H$14)","v":1284.8},{"$f":"M11*(1+$H$14)","v":1290.9000000000001},{"$f":"D21*(1+H14)","v":1296.8},{"$f":"E23*(1+H14)","v":1302.6500000000001},{"$f":"D24*(1+H14)","v":1308.5999999999999},{"$f":"E26*(1+H14)","v":1314.65},{"$f":"D27*(1+H14)","v":1320.9},{"$f":"D28*(1+H14)","v":1327.0500000000002},{"$f":"D29*(1+H14)","v":1333.2},{"$f":"D30*(1+H14)","v":1339.25},{"$f":"D31*(1+H14)","v":1345.3},{"$f":"D32*(1+H14)","v":1351.4499999999998},{"$f":"D33*(1+H14)","v":1357.6},{"$f":"D34*(1+H14)","v":1363.65},{"$f":"D35*(1+H14)","v":1369.7}]
[]
{"$rows_left_out":48}
{"sheet":"Base Model","index":1,"n_rows":102,"n_cols":23,"rows_kept":102,"cut":false,"hidden":false,"merged":[]}
[]
[]
[]
[null,"Assumptions"]
[null,"Start Year",null,null,null,2017]
[null,"Start Quarter",null,null,null,3]
[null,"Pit A Initial Production Rate",null,null,null,250,"k oz/ qtr"]
[null,"Pit A Decline Rate",null,null,null,2.5000000000000001E-2,"% / qrt"]
[null,"Avg. Gold Price",null,null,null,{"$f":"IF(('Monte Carlo Simulation (1000)'!$L$2=\"Simulate\"),(1300*(1+'Monte Carlo Simulation (1000)'!$N$5)),(1300*(1+Scenario!$E$15)))","v":1300},"US$ / oz"]
[null,"Avg. AUD Rate",null,null,null,{"$f":"IF(('Monte Carlo Simulation (1000)'!$L$2=\"Simulate\"),(0.78*(1+'Monte Carlo Simulation (1000)'!$N$6)),(0.78*(1+Scenario!$E$14)))","v":0.78},"AUDUSD"]
[null,"Expansion CapEX",null,null,null,125,"AUD MM / qrt"]
[null,"Cost Inflation",null,null,null,{"$f":"2%","v":0.02},"% pa"]
[null,"DA",null,null,null,20,"AUD MM"]
[null,"Tax Rate",null,null,null,0.3]
[null,"Debt ",null,null,null,1000,"AUD MM"]
{"$rows_left_out":88}
{"sheet":"Hedged Model","index":2,"n_rows":166,"n_cols":23,"rows_kept":166,"cut":false,"hidden":false,"merged":[]}
[]
["Gold Dust Expansion: Hedged Model"]
[]
[null,"Model Assumptions "]
[null,"Start Year",null,null,null,2017]
[null,"Start Quarter",null,null,null,3]
[null,"Pit A Initial Production Rate",null,null,null,250,"k oz/ qtr"]
[null,"Pit A Decline Rate",null,null,null,2.5000000000000001E-2,"% / qrt"]
[null,"Avg. Gold Price",null,null,null,{"$f":"IF(('Monte Carlo Simulation (1000)'!A2=\"Simulate\"),(1350*(1+'Monte Carlo Simulation (1000)'!$C$5)),(1350*(1+Scenario!E15)))","v":1350},"US$ / oz"]
[null,"Avg. AUD/USD  Rate",null,null,null,{"$f":"IF('Monte Carlo Simulation (1000)'!A2=\"Simulate\",(0.78*(1+'Monte Carlo Simulation (1000)'!$C$6)),0.78*(1+Scenario!$E$14))","v":0.78},"AUDUSD"]
[null,"Expansion CapEX",null,null,null,125,"AUD MM / qrt"]
[null,"Cost Inflation",null,null,null,{"$f":"2%","v":0.02},"% pa"]
[null,"DA",null,null,null,20,"AUD MM"]
[null,"Tax Rate",null,null,null,0.3]
[null,"Debt ",null,null,null,1000,"AUD MM"]
{"$rows_left_out":152}
{"sheet":"Scenario","index":3,"n_rows":141,"n_cols":27,"rows_kept":141,"cut":false,"hidden":false,"merged":[[128,2,128,12],[89,2,89,12],[46,2,46,12],[46,15,46,25],[128,15,128,25]]}
[]
["Gold Dust Expansion: Scenario Analysis"]
[null,null,null,null,null,null,null,null,null,null,null,null,null,null,null,null,null,null,null,null,null,null,null,null,null,null,"Base"]
[null,null,"Scenario Manager"]
[]
[null,null,"Case Selector","Selection",1,null,"Change Case for Different Scenarios"]
[null,null,"Number of scenarios","Num#",{"$f":"COUNT(F11:K11)","v":6}]
[null,null,"Hedging Percentage",null,0.8]
[]
[null,null,null,null,null,"Case",null,null,null,null,null,null,"Profile of Scenarios for Gold Dust"]
[null,null,null,null,"Active",1,2,3,4,5,6]
[null,null,null,null,{"$f":"INDEX($F12:$K12,1,E$6)","v":"Base Case"},"Base Case","Price Dn","Interest Up","Forex Up","Combined Up","Combined Down",null,null,"Case Selected",{"$f":"E16","v":"Base"}]
[null,null,"Interest Rates",null,{"$f":"IF(INDEX($F13:$K13,1,E$6)=\"\",F13,INDEX($F13:$K13,1,E$6))","v":0},0,0,0.2,0,-0.2,0.2,null,null,"Price Case"]
[null,null,"Forex (AUD/USD)",null,{"$f":"IF(INDEX($F14:$K14,1,E$6)=\"\",F14,INDEX($F14:$K14,1,E$6))","v":0},0,0,0,0.2,-0.2,0.2,null,{"$f":"IF($O$12=N14,1,0)","v":1},"Base","USD/Oz","Value Changes of 0%"]
[null,null,"Price",null,{"$f":"IF(INDEX($F15:$K15,1,E$6)=\"\",F15,INDEX($F15:$K15,1,E$6))","v":0},0,-0.2,0,0,0.2,-0.2,null,{"$f":"IF($O$12=N15,1,0)","v":0},"Pessimistic","USD/Oz","Adverse Changes of 20%"]
{"$rows_left_out":127}
{"sheet":"Sensitivity Analysis","index":4,"n_rows":115,"n_cols":10,"rows_kept":115,"cut":false,"hidden":false,"merged":[]}
[]
["Gold Dust Expansion: Sensitivity Analysis"]
[]
[null,null,"Sensitivity Analysis (Unhedged Model)"]
[]
[null,null,"Range of sensitivity Inputs (+/- 20%)"]
[]
[]
[null,null,"Gold Price +/-20%",null,"Interest Rate +/-20%",null,"Forex (AUD/USD) +/-20%",null,"Inflation +/-20%"]
[null,null,"Change","FCF","Change","FCF","Change","FCF","Change","FCF"]
[null,null,0,-3.1059879262869003,0,-3.1059879262869003,0,-3.1059879262869003,0,-3.1059879262869003]
[null,null,-0.2,-368.34208092793216,-0.2,18,-0.2,453,-0.2,4.8119142861723105]
[null,null,0.2,362,0.2,-24.105987926286787,0.2,-307.469398760991,0.2,-11.037320895267868]
[]
[]
{"$rows_left_out":101}
{"sheet":"Risk Strategy","index":5,"n_rows":255,"n_cols":30,"rows_kept":255,"cut":false,"hidden":false,"merged":[[25,13,35,13],[13,13,23,13]]}
[]
["Put:",null,null,null,"GOLD 100 OZ FUTR COMDTY (CMX)",null,null,null,null,null,null,null,null,null,"Assumptions:"]
["Call:",null,null,null,null,null,null,null,null,null,null,null,null,null,"Spot FX rate",0.78,null,"Assumption Key:"]
["2018-12-01",null,null,null,null,null,{"$f":"Assumptions!$D$18","v":1284.8},null,null,null,null,null,null,null,"Spot price",1300,null,"Favourable Δ"]
["Strike","Ticker","Bid","Ask","Call Settlement","Open Int","Strike","Ticker","Bid","Ask","Put Settlement","Open Int",null,null,"Hedge Ratio",1,null,"Base Δ"]
[1275,"GCZ7C",0,0,25.7,3294,null,"GCZ7P",0,31,15.9,2497,null,null,"Gold Price Δ",{"$f":"Scenario!E15","v":0},null,"Adverse Δ"]
[1280,"GCZ7C",0,0,23.1,1295,null,"GCZ7P",0,27.3,18.3,3650,null,null,"AUD/USD  Δ",{"$f":"Scenario!E14","v":0}]
[1285,"GCZ7C",0,34.5,20.6,795,null,"GCZ7P",0,25.4,20.8,1112,null,null,null,null,null,"            Options on Gold Futures"]
[1290,"GCZ7C",0,0,18.399999999999999,1376,null,"GCZ7P",3,0,23.6,1563,null,null,null,null,"(Option prices & premiums were sourced from Bloomberg Terminals on the 29th September 2017)"]
[1295,"GCZ7C",9.1,0,16.399999999999999,996,null,"GCZ7P",0,0,26.6,664,null,null,null,null,null,null,null,null,null,null,null,null,"Increments",{"$f":"25","v":25}]
[1300,"GCZ7C",11.5,150,14.5,8511,null,"GCZ7P",19,49,29.7,3905]
[1305,"GCZ7C",0,0,12.9,839,null,"GCZ7P",0,0,33.1,884,null,null,null,null,"18Q2","18Q3","18Q4","19Q1","19Q2","19Q3","19Q4",null,"Spot Price","Short Call","Long Put","P/L","Underlying","Total P/L"]
[1310,"GCZ7C",0,0,11.4,834,null,"GCZ7P",13.9,0,36.6,662,null,null,null,null,2,3,4,1,2,3,4,null,1100,{"$f":"((-MAX(Y13-$Q$15,0)*$Q$18)-($Q$20*$Q$18))/1000000","v":4.2635531249999996},{"$f":"((MAX($Q$27-Y13,0)*$Q$30)-($Q$32*$Q$30))/1000000","v":37.468290234374997},{"$f":"SUM(Z13:AA13)","v":41.731843359374999},{"$f":"((Y13)*$Q$18)/1000000","v":254.88632812500001},{"$f":"SUM(AB13:AC13)","v":296.61817148437501}]
[1315,"GCZ7C",0,15.5,10.1,1260,null,"GCZ7P",0,0,40.200000000000003,748,null,"Short Call","Futures \"spot\" price",null,{"$f":"Q26","v":1284.8},{"$f":"R26","v":1290.9000000000001},1296.8,1302.6500000000001,1308.5999999999999,1314.65,1320.9,null,{"$f":"Y13+$Z$10","v":1125},{"$f":"((-MAX(Y14-$Q$15,0)*$Q$18)-($Q$20*$Q$18))/1000000","v":4.2635531249999996},{"$f":"((MAX($Q$27-Y14,0)*$Q$30)-($Q$32*$Q$30))/1000000","v":31.675419140624999},{"$f":"SUM(Z14:AA14)","v":35.938972265624997},{"$f":"((Y14)*$Q$18)/1000000","v":260.67919921875},{"$f":"SUM(AB14:AC14)","v":296.61817148437501}]
[{"$f":"A14+5","v":1320},"GCZ7C",null,null,8.9,null,null,null,null,null,45.9,null,null,null,"Strike Price",null,1290,1300,1300,1305,1310,1320,1325,null,{"$f":"Y14+$Z$10","v":1150},4.2635531249999996,25.882548046875002,30.146101171875003,266.47207031250002,296.61817148437501]
{"$rows_left_out":241}
{"sheet":"FX Margins","index":6,"n_rows":58,"n_cols":18,"rows_kept":58,"cut":false,"hidden":false,"merged":[]}
[]
[]
["        Assumptions",null,null,null,null,"Margin Call Caluclations for Long Position on AUS FX Futures",null,null,null,null,null,null,null,"   Summarised Tables"]
[null,null,null,null,null,"(Initial & Maintenance Margins were sourced from Bloomberg Terminals on the 29th September 2017)"]
[]
["Assumtions for Calculations of Margins",null,null,{"$f":"IF('Monte Carlo Simulation (1000)'!$A$2=\"Simulate\",'Monte Carlo Simulation (1000)'!$C$6,Scenario!$E$14)","v":0},"Forex Appreciation/Deprecation",null,null,null,null,null,null,null,"Margin Calls Required USD",null,null,"Margin Calls Reinbursed USD"]
[null,null,null,null,null,null,null,"Initial",{"$f":"1450","v":1450},null,null,null,"19Q2",{"$f":"-J19","v":0},null,"19Q2",null,{"$f":"IF((N7<0),N7*-1,N7)","v":0}]
["Hedging Percentage:",1,null,null,null,null,null,"Maint",{"$f":"1450","v":1450},null,null,null,"19Q3",{"$f":"-$J$37","v":0},null,"19Q3",null,{"$f":"IF((N8<0),N8*-1,N8)","v":0}]
[null,null,null,null,null,null,null,"AUD",100000,null,null,null,"19Q4",{"$f":"-$J$55","v":0},null,"19Q4",null,{"$f":"IF((N9<0),N9*-1,N9)","v":0}]
["Spot Revenue to Hedge AUD:",null,null,null,null,null,null,"No of Contract",{"$f":"B18","v":3489.9649729156499},null,null,null,null,{"$f":"SUM(N7:N9)","v":0},null,"Sum",null,{"$f":"IF((N10<0),N10*-1,N10)","v":0}]
[]
["19Q2",0,null,null,{"$error":"#N/A"},"Futures","Gain/Loss","Cumulative gain/loss","Margin Balance","Margin Call","New Margin Balance",null,"Initial Margins",null,null,"Initial Margins to be Reinbursed @ Contract Expirations"]
["19Q3",0,"2019-12-01",null,null,0.78256499999999996,null,null,{"$f":"I7*I10","v":5060449.2107276926},null,null,null,"19Q2",{"$f":"-I7*I10","v":-5060449.2107276926},null,"19Q2",null,{"$f":"N13*-1","v":5060449.2107276926}]
["19Q4",0,null,null,"19Q2",{"$f":"0.77946*(1+$D$6)","v":0.77946000000000004},{"$f":"IF(($D$6=0),0,(F14-F13)*$I$9*$I$10)","v":0},{"$f":"G14","v":0},{"$f":"I13+G14","v":5060449.2107276926},{"$f":"IF((I14>$I$8),($I$13-I14),IF($D$6=0,0,($I$13-I14)))","v":0},{"$f":"I14+J14","v":5060449.2107276926},null,"19Q3",{"$f":"-I25*I28","v":-5175604.6471261596},null,"19Q3",null,{"$f":"N14*-1","v":5175604.6471261596}]
[null,null,null,null,"19Q3",{"$f":"0.7784549*(1+$D$6)","v":0.77845489999999995},0,0,{"$f":"K14+G15","v":5060449.2107276926},{"$f":"IF((I15>$I$8),0,IF($D$6=0,0,($I$7-I15)))","v":0},{"$f":"I15+J15","v":5060449.2107276926},null,"19Q4",{"$f":"-I42*I45","v":-6018922.8642813414},null,"19Q4",null,{"$f":"N15*-1","v":6018922.8642813414}]
{"$rows_left_out":44}
{"sheet":"Gold Future Margins","index":7,"n_rows":145,"n_cols":18,"rows_kept":145,"cut":false,"hidden":false,"merged":[]}
[]
[]
["        Assumptions",null,null,null,null,"Margin Call Caluclations for Short Call on GC Gold 100 Future Contracts",null,null,null,null,null,null,null,"         Summarised Tables"]
[null,null,null,null,null,"(Initial & Maintenance Margins were sourced from Bloomberg Terminals on the 29th September 2017)"]
[]
["Assumtions for Calculations of Margins",null,null,{"$f":"IF('Monte Carlo Simulation (1000)'!$A$2=\"Simulate\",'Monte Carlo Simulation (1000)'!$C$5,Scenario!$E$15)","v":0},"Gold Price Change",null,null,"Initial",4900,null,null,null,"Margin Calls Required USD",null,null,"Margin Calls Reinbursed USD"]
[null,null,null,null,null,null,null,"Maint",4900,null,null,null,"18Q2",{"$f":"J21","v":0},null,"18Q2",null,{"$f":"IF((N7<0),N7*-1,N7)","v":0}]
["Hedging Percentage:",{"$f":"Scenario!$E$8","v":0.8},null,null,null,null,null,"Troy Ounce",100,null,null,null,"18Q3",{"$f":"$J$41","v":0},null,"18Q3",null,{"$f":"IF((N8<0),N8*-1,N8)","v":0}]
[null,null,null,null,null,null,null,"No of Contract",{"$f":"$B$20","v":1853.7187500000002},null,null,null,"18Q4",{"$f":"$J$61","v":0},null,"18Q4",null,0]
["Spot Revenue to Hedge AUD:",null,null,null,null,null,null,null,null,null,null,null,"19Q1",{"$f":"$J$82","v":0},null,"19Q1",null,0]
["18Q2",0,null,null,null,"Futures","Gain/Loss","Cumulative gain/loss","Margin Balance","Margin Call","New Margin Balance",null,"19Q2",{"$f":"$J$102","v":0},null,"19Q2",null,0]
["18Q3",0,null,null,null,1284.8,null,null,{"$f":"I6*I9","v":9083221.8750000019},null,null,null,"19Q3",{"$f":"$J$122","v":0},null,"19Q3",null,0]
["18Q4",0,"2017-12-01",null,"18Q2",{"$f":"Assumptions!$D$18*(1+$D$6)","v":1284.8},{"$f":"IF(($D$6=0),0,(F12-$F$13)*$I$8*$I$9)","v":0},{"$f":"G13","v":0},{"$f":"I12+G13","v":9083221.8750000019},{"$f":"IF((I13>$I$7),(0),($I$12-I13))","v":0},{"$f":"I13+J13","v":9083221.8750000019},null,"19Q4",{"$f":"$J$142","v":0},null,"19Q4",null,0]
["19Q1",0,"2017-12-01",null,"18Q3",{"$f":"Assumptions!$E$20*(1+$D$6)","v":1290.9000000000001},0,0,{"$f":"IF(K$13=$I$12,$I$12,K13+G14)","v":9083221.8750000019},{"$f":"IF((I14>$I$7),0,($I$6-I14))","v":0},9083221.8750000019,null,"Sum of Margin Payment",{"$f":"SUM(N7:N13)","v":0},null,"Sum",null,0]
["19Q2",0,2,null,"18Q4",{"$f":"Assumptions!$D$21*(1+$D$6)","v":1296.8},0,{"$f":"G15+G14","v":0},{"$f":"K14+G15","v":9083221.8750000019},0,9083221.8750000019]
{"$rows_left_out":131}
{"sheet":"Monte Carlo Simulation (1000)","index":8,"n_rows":1026,"n_cols":16,"rows_kept":1026,"cut":false,"hidden":false,"merged":[]}
["Drop Down Menu!",null,null,null,null,null,null,null,null,null,null,"Unhedged"]
["Don't Simulate","<---- Change to Simulate for a similuation for the HEDGED mine",null,null,null,null,null,null,null,null,null,"Don't Simulate","<---- Change to Simulate for a similuation for the UNHEDGED mine"]
["Monte Carlo Simulation Assumptions",null,null,null,null,null,null,null,null,null,null,"Monte Carlo Simulation Assumptions"]
[]
["Gold Price",{"$f":"RANDBETWEEN(-20,20)","v":-13},{"$f":"B5/100","v":-0.13},null,null,null,null,null,null,null,null,"Gold Price",{"$f":"RANDBETWEEN(-20,20)","v":-20},{"$f":"M5/100","v":-0.2}]
["Forex",{"$f":"RANDBETWEEN(-20,20)","v":14},{"$f":"B6/100","v":0.14000000000000001},null,null,null,null,null,null,null,null,"Forex",{"$f":"M5*0.8","v":-16},{"$f":"M6/100","v":-0.16}]
["Interest Rates",{"$f":"RANDBETWEEN(-20,20)","v":6},{"$f":"B7/100","v":0.06},null,null,null,null,null,null,null,null,"Interest Rates",{"$f":"RANDBETWEEN(-20,20)","v":20},{"$f":"M7/100","v":0.2}]
["Assumptions for CFaR (Hedged)",null,null,null,null,null,null,null,null,null,null,"Assumptions for CFaR (Hedged)"]
["Cash on Hand @ 19Q4",null,{"$f":"E23","v":76.994189278516103},null,null,null,null,null,null,null,null,"Cash on Hand @ 19Q4",null,{"$f":"'Base Model'!$M$60","v":-3.1059879262869003}]
["Confidence Interval",null,0.95,null,null,null,null,null,null,null,null,"Confidence Interval",null,0.95]
["Standard Deviation",null,{"$f":"$C$16","v":1.2085270654663668E-12},null,null,null,null,null,null,null,null,"Standard Deviation",null,{"$f":"$N$16","v":3.0213176636659168E-14}]
["Expected Cash on Hand",null,{"$f":"$C$15","v":76.994189278514895},null,null,null,null,null,null,null,null,"Expected Cash on Hand",null,{"$f":"$N$15","v":-3.1059879262869305}]
["Value at Risk (Var, in Millions)",null,{"$f":"_xlfn.NORM.INV((1-$C$10),$C$12,$C$11)","v":76.994189278512906},null,null,null,null,null,null,null,null,"Value at Risk (Var, in Millions)",null,{"$f":"_xlfn.NORM.INV((1-$N$10),$N$12,$N$11)","v":-3.1059879262869803}]
["Monte Carlo Simulation (Hedged)",null,null,null,null,null,null,null,null,null,null,"Monte Carlo Simulation (Hedged)"]
["Mean",null,{"$f":"AVERAGE(B27:B10026)","v":76.994189278514895},null,null,null,null,null,null,null,null,"Mean",null,{"$f":"AVERAGE(N27:N1026)","v":-3.1059879262869305}]
{"$rows_left_out":1012}
{"sheet":"Charts from Monte Carlo","index":9,"n_rows":0,"n_cols":0,"rows_kept":0,"cut":false,"hidden":false,"merged":[]}

{"sheet":"Random Data","index":10,"n_rows":42,"n_cols":19,"rows_kept":42,"cut":false,"hidden":false,"merged":[[8,2,8,3],[8,4,8,5],[11,10,11,11],[11,12,11,13]]}
["Forwards"]
[]
["Currencies","XAU","USD",null,"via","--"]
["Market",null,null,null,null,null,null,null,"Forwards"]
["Spot Source","BGN"]
["Fwd Source","CMPN",null,null,null,null,null,null,"Currencies","AUD","USD",null,"via","--"]
[null,null,null,null,null,null,null,null,"Market"]
["Forward Curve",null,null,null,null,null,null,null,"Spot Source","BGN"]
[null,"Dates","Rates Bid/Ask",null,"Forwards Bid/Ask",null,null,null,"Fwd Source","BGN"]
["ON","10/02/2017"]
["TN","10/03/2017",null,null,null,null,null,null,"Forward Curve"]
["SP","10/03/2017",1277.52,1281.98,1277.52,1281.98,null,null,null,"Dates","Points Bid/Ask",null,"Forwards Bid/Ask",null,"Midpoint",null,null,"ADZ7 COMB CURNCY AUDUSD Crncy Fut"]
["SN","10/04/2017",1.38,1.53,1277.569,1282.0345,null,null,"ON","10/03/2017",-0.25,-0.19800000000000001,0.78292430000000002,0.78393449999999998,{"$f":"(M13+N13)/2","v":0.78342939999999994},null,null,"AUD/USD Future"]
["1W","10/10/2017",1.38,1.53,1277.8628000000001,1282.3614,null,null,"TN","10/04/2017",-9.5000000000000001E-2,-4.4999999999999998E-2,0.7829045,0.78390950000000004,{"$f":"(M14+N14)/2","v":0.78340699999999996},null,null,"Date"]
["2W","10/17/2017",1.4,1.55,1278.2155,1282.7527,null,null,"SP","10/04/2017",0.78290000000000004,0.78390000000000004,0.78290000000000004,0.78390000000000004,0.7834000000000001,null,null,"2017-10-01",0.78420000000000001]
{"$rows_left_out":27}